Target
Neprilysin
Ligand
BDBM50190766
Substrate
Meas. Tech.
ChEMBL_369150 (CHEMBL862877)
IC50
374±n/a nM
Citation
 Pryde, DCMaw, GNPlanken, SPlatts, MYSanderson, VCorless, MStobie, ABarber, CGRussell, RFoster, LBarker, LWayman, CVan Der Graaf, PStacey, PMorren, DKohl, CBeaumont, KCoggon, STute, M Novel selective inhibitors of neutral endopeptidase for the treatment of female sexual arousal disorder. Synthesis and activity of functionalized glutaramides. J Med Chem 49:4409-24 (2006)  
Target
Name:
Neprilysin
Synonyms:
Atriopeptidase CD_antigen=CD10 EPN MME NEP_HUMAN Neutral endopeptidase | Neutral endopeptidase 24.11
Type:
Enzyme
Mol. Mass.:
85505.38
Organism:
Homo sapiens (Human)
Description:
P08473
Residue:
750
  
Inhibitor
Name:
BDBM50190766
Synonyms:
2-((1-((6-methoxypyridazin-3-yl)carbamoyl)cyclopentyl)methyl)pentanoic acid | CHEMBL211943
Type:
Small organic molecule
Emp. Form.:
C17H25N3O4
Mol. Mass.:
335.3981
SMILES:
CCCC(CC1(CCCC1)C(=O)Nc1ccc(OC)nn1)C(O)=O
: