Target
Neprilysin
Ligand
BDBM50190740
Substrate
Meas. Tech.
ChEMBL_369150 (CHEMBL862877)
IC50
700±n/a nM
Citation
 Pryde, DCMaw, GNPlanken, SPlatts, MYSanderson, VCorless, MStobie, ABarber, CGRussell, RFoster, LBarker, LWayman, CVan Der Graaf, PStacey, PMorren, DKohl, CBeaumont, KCoggon, STute, M Novel selective inhibitors of neutral endopeptidase for the treatment of female sexual arousal disorder. Synthesis and activity of functionalized glutaramides. J Med Chem 49:4409-24 (2006)  
Target
Name:
Neprilysin
Synonyms:
Atriopeptidase CD_antigen=CD10 EPN MME NEP_HUMAN Neutral endopeptidase | Neutral endopeptidase 24.11
Type:
Enzyme
Mol. Mass.:
85505.38
Organism:
Homo sapiens (Human)
Description:
P08473
Residue:
750
  
Inhibitor
Name:
BDBM50190740
Synonyms:
2-((1-(((5-methyl-1,3,4-thiadiazol-2-yl)methyl)carbamoyl)cyclopentyl)methyl)pentanoic acid | CHEMBL377618
Type:
Small organic molecule
Emp. Form.:
C16H25N3O3S
Mol. Mass.:
339.453
SMILES:
CCCC(CC1(CCCC1)C(=O)NCc1nnc(C)s1)C(O)=O
: