Target
Neprilysin
Ligand
BDBM50190772
Substrate
Meas. Tech.
ChEMBL_369150 (CHEMBL862877)
IC50
370±n/a nM
Citation
 Pryde, DCMaw, GNPlanken, SPlatts, MYSanderson, VCorless, MStobie, ABarber, CGRussell, RFoster, LBarker, LWayman, CVan Der Graaf, PStacey, PMorren, DKohl, CBeaumont, KCoggon, STute, M Novel selective inhibitors of neutral endopeptidase for the treatment of female sexual arousal disorder. Synthesis and activity of functionalized glutaramides. J Med Chem 49:4409-24 (2006)  
Target
Name:
Neprilysin
Synonyms:
Atriopeptidase CD_antigen=CD10 EPN MME NEP_HUMAN Neutral endopeptidase | Neutral endopeptidase 24.11
Type:
Enzyme
Mol. Mass.:
85505.38
Organism:
Homo sapiens (Human)
Description:
P08473
Residue:
750
  
Inhibitor
Name:
BDBM50190772
Synonyms:
CHEMBL213240 | cis-2-((1-((4-(dimethylcarbamoyl)cyclohexyl)carbamoyl)cyclopentyl)methyl)pentanoic acid
Type:
Small organic molecule
Emp. Form.:
C21H36N2O4
Mol. Mass.:
380.5215
SMILES:
CCCC(CC1(CCCC1)C(=O)N[C@H]1CC[C@H](CC1)C(=O)N(C)C)C(O)=O
: