Target
Cytochrome P450 2D6
Ligand
BDBM50161764
Substrate
Meas. Tech.
ChEMBL_369007 (CHEMBL870289)
IC50
>3000±n/a nM
Citation
 Wishka, DGWalker, DPYates, KMReitz, SCJia, SMyers, JKOlson, KLJacobsen, EJWolfe, MLGroppi, VEHanchar, AJThornburgh, BACortes-Burgos, LAWong, EHStaton, BARaub, TJHigdon, NRWall, TMHurst, RSWalters, RRHoffmann, WEHajos, MFranklin, SCarey, GGold, LHCook, KKSands, SBZhao, SXSoglia, JRKalgutkar, ASArneric, SPRogers, BN Discovery of N-[(3R)-1-azabicyclo[2.2.2]oct-3-yl]furo[2,3-c]pyridine-5-carboxamide, an agonist of the alpha7 nicotinic acetylcholine receptor, for the potential treatment of cognitive deficits in schizophrenia: synthesis and structure--activity relationship. J Med Chem 49:4425-36 (2006)  
Target
Name:
Cytochrome P450 2D6
Synonyms:
CP2D6_HUMAN CYP2DL1 Cytochrome P450 2D6 (CYP2D6) P450-DB1
Type:
Protein
Mol. Mass.:
55774.82
Organism:
Homo sapiens (Human)
Description:
P10635
Residue:
497
  
Inhibitor
Name:
BDBM50161764
Synonyms:
(R)-4-chloro-N-(quinuclidin-3-yl)benzamide CHEMBL177611 PNU-282987 | PNU282987
Type:
Small organic molecule
Emp. Form.:
C14H17ClN2O
Mol. Mass.:
264.751
SMILES:
Clc1ccc(cc1)C(=O)N[C@H]1CN2CCC1CC2
: