Target
Neuronal acetylcholine receptor subunit alpha-3/beta-4
Ligand
BDBM50190788
Substrate
Meas. Tech.
ChEMBL_369001 (CHEMBL870255)
IC50
>100000±n/a nM
Citation
 Wishka, DGWalker, DPYates, KMReitz, SCJia, SMyers, JKOlson, KLJacobsen, EJWolfe, MLGroppi, VEHanchar, AJThornburgh, BACortes-Burgos, LAWong, EHStaton, BARaub, TJHigdon, NRWall, TMHurst, RSWalters, RRHoffmann, WEHajos, MFranklin, SCarey, GGold, LHCook, KKSands, SBZhao, SXSoglia, JRKalgutkar, ASArneric, SPRogers, BN Discovery of N-[(3R)-1-azabicyclo[2.2.2]oct-3-yl]furo[2,3-c]pyridine-5-carboxamide, an agonist of the alpha7 nicotinic acetylcholine receptor, for the potential treatment of cognitive deficits in schizophrenia: synthesis and structure--activity relationship. J Med Chem 49:4425-36 (2006)  
Target
Name:
Neuronal acetylcholine receptor subunit alpha-3/beta-4
Synonyms:
Neuronal acetylcholine receptor protein alpha-3/beta-4 subunit | Neuronal acetylcholine receptor; alpha3/beta4
Type:
Mol. Mass.:
Description:
ASSAY_ID of ChEMBL is 1970247
Components:
This complex has 2 components.
Component 1
Name:
Neuronal acetylcholine receptor subunit beta-4
Synonyms:
ACHB4_HUMAN Cholinergic, Nicotinic Alpha6Beta3Beta4Alpha5 Nicotinic acetylcholine receptor alpha6/alpha3/beta4
Type:
Enzyme Catalytic Domain
Mol. Mass.:
56388.51
Organism:
Homo sapiens (Human)
Description:
Cholinergic, Nicotinic Alpha6Beta3Beta4Alpha5 0 HUMAN::P30926
Residue:
498
  
Component 2
Name:
Neuronal acetylcholine receptor subunit alpha-3
Synonyms:
ACHA3_HUMAN Cholinergic, Nicotinic Alpha3Beta2 Cholinergic, Nicotinic Alpha3Beta4x NACHRA3 Neuronal acetylcholine receptor subunit alpha-3 nicotinic central
Type:
Enzyme Catalytic Domain
Mol. Mass.:
57479.03
Organism:
Homo sapiens (Human)
Description:
Cholinergic, Nicotinic Alpha3Beta2 0 HUMAN::P32297
Residue:
505
  
Inhibitor
Name:
BDBM50190788
Synonyms:
CHEMBL378471 | N-[(3R)-1-azabicyclo[2.2.2]oct-3-yl]-1-benzofuran-5-carboxamide
Type:
Small organic molecule
Emp. Form.:
C16H18N2O2
Mol. Mass.:
270.3263
SMILES:
O=C(N[C@H]1CN2CCC1CC2)c1ccc2occc2c1
: