Target
Acetylcholine receptor subunit alpha/beta/delta/gamma
Ligand
BDBM50190785
Substrate
Meas. Tech.
ChEMBL_369002 (CHEMBL870261)
IC50
>100000±n/a nM
Citation
 Wishka, DGWalker, DPYates, KMReitz, SCJia, SMyers, JKOlson, KLJacobsen, EJWolfe, MLGroppi, VEHanchar, AJThornburgh, BACortes-Burgos, LAWong, EHStaton, BARaub, TJHigdon, NRWall, TMHurst, RSWalters, RRHoffmann, WEHajos, MFranklin, SCarey, GGold, LHCook, KKSands, SBZhao, SXSoglia, JRKalgutkar, ASArneric, SPRogers, BN Discovery of N-[(3R)-1-azabicyclo[2.2.2]oct-3-yl]furo[2,3-c]pyridine-5-carboxamide, an agonist of the alpha7 nicotinic acetylcholine receptor, for the potential treatment of cognitive deficits in schizophrenia: synthesis and structure--activity relationship. J Med Chem 49:4425-36 (2006)  
Target
Name:
Acetylcholine receptor subunit alpha/beta/delta/gamma
Synonyms:
Acetylcholine receptor protein alpha chain/beta chain/delta chain /gamma chain | Acetylcholine receptor; alpha1/beta1/delta/gamma
Type:
Mol. Mass.:
Description:
ASSAY_ID of EBI is 369002
Components:
This complex has 4 components.
Component 1
Name:
Acetylcholine receptor subunit alpha
Synonyms:
ACHA_HUMAN Acetylcholine receptor protein alpha chain CHNRA Cholinergic, Nicotinic Alpha1Beta1DeltaGamma Nicotinic acetylcholine receptor alpha-1/beta-1 Nicotinic acetylcholine receptor alpha2/beta4 n-AChR
Type:
Ion channel
Mol. Mass.:
54542.01
Organism:
Homo sapiens (Human)
Description:
Residue:
482
  
Component 2
Name:
Acetylcholine receptor subunit beta
Synonyms:
ACHB_HUMAN Acetylcholine receptor subunit beta CHRNB1 | Nicotinic acetylcholine receptor alpha-1/beta-1/delta/epsilon
Type:
PROTEIN
Mol. Mass.:
56691.23
Organism:
Homo sapiens (Human)
Description:
EBI_10924
Residue:
501
  
Component 3
Name:
Acetylcholine receptor subunit gamma
Synonyms:
ACHG_HUMAN Acetylcholine receptor subunit gamma Muscle-type nicotinic acetylcholine receptor
Type:
PROTEIN
Mol. Mass.:
57880.69
Organism:
Homo sapiens (Human)
Description:
EBI_11211
Residue:
517
  
Component 4
Name:
Acetylcholine receptor subunit delta
Synonyms:
ACHD_HUMAN Acetylcholine receptor protein delta chain Muscle-type nicotinic acetylcholine receptor | Nicotinic acetylcholine receptor alpha-1/beta-1/delta/epsilon
Type:
PROTEIN
Mol. Mass.:
58894.39
Organism:
Homo sapiens (Human)
Description:
ChEMBL_142595
Residue:
517
  
Inhibitor
Name:
BDBM50190785
Synonyms:
CHEMBL378349 | N-[(3R)-1-azabicyclo[2.2.2]oct-3-yl]-1-benzothiophene-6-carboxamide
Type:
Small organic molecule
Emp. Form.:
C16H18N2OS
Mol. Mass.:
286.392
SMILES:
O=C(N[C@H]1CN2CCC1CC2)c1ccc2ccsc2c1
: