Target
Neuronal acetylcholine receptor subunit alpha-7
Ligand
BDBM50190783
Substrate
Meas. Tech.
ChEMBL_368997 (CHEMBL869740)
Ki
12.5±n/a nM
Citation
 Wishka, DGWalker, DPYates, KMReitz, SCJia, SMyers, JKOlson, KLJacobsen, EJWolfe, MLGroppi, VEHanchar, AJThornburgh, BACortes-Burgos, LAWong, EHStaton, BARaub, TJHigdon, NRWall, TMHurst, RSWalters, RRHoffmann, WEHajos, MFranklin, SCarey, GGold, LHCook, KKSands, SBZhao, SXSoglia, JRKalgutkar, ASArneric, SPRogers, BN Discovery of N-[(3R)-1-azabicyclo[2.2.2]oct-3-yl]furo[2,3-c]pyridine-5-carboxamide, an agonist of the alpha7 nicotinic acetylcholine receptor, for the potential treatment of cognitive deficits in schizophrenia: synthesis and structure--activity relationship. J Med Chem 49:4425-36 (2006)  
Target
Name:
Neuronal acetylcholine receptor subunit alpha-7
Synonyms:
ACHA7_RAT Cholinergic, Nicotinic Alpha7 Chrna7 Neuronal acetylcholine receptor (alpha7 nAChR) Neuronal acetylcholine receptor subunit alpha-7 Neuronal acetylcholine receptor subunit alpha-7 (nAChR)
Type:
Enzyme
Mol. Mass.:
56502.44
Organism:
Rattus norvegicus (Rat)
Description:
Q05941
Residue:
502
  
Inhibitor
Name:
BDBM50190783
Synonyms:
CHEMBL379302 | N-[(3R)-1-azabicyclo[2.2.2]oct-3-yl]-1-benzofuran-6-carboxamide
Type:
Small organic molecule
Emp. Form.:
C16H18N2O2
Mol. Mass.:
270.3263
SMILES:
O=C(N[C@H]1CN2CCC1CC2)c1ccc2ccoc2c1
: