Target
11-beta-hydroxysteroid dehydrogenase type 2
Ligand
BDBM50195294
Substrate
Meas. Tech.
ChEMBL_424848 (CHEMBL907398)
IC50
>10000±n/a nM
Citation
 Sorensen, BRohde, JWang, JFung, SMonzon, KChiou, WPan, LDeng, XStolarik, DFrevert, EUJacobson, PLink, JT Adamantane 11-beta-HSD-1 inhibitors: Application of an isocyanide multicomponent reaction. Bioorg Med Chem Lett 16:5958-62 (2006)  
Target
Name:
11-beta-hydroxysteroid dehydrogenase type 2
Synonyms:
11-DH2 11-beta-Hydroxysteroid Dehydrogenase 2 (11-beta-HSD2) 11-beta-hydroxysteroid dehydrogenase 2 11-beta-hydroxysteroid dehydrogenase type 2 (11-beta-HSD2) DHI2_HUMAN HSD11K SDR9C3
Type:
Enzyme
Mol. Mass.:
44141.72
Organism:
Homo sapiens (Human)
Description:
Purified recombinant human 11beta-HSD2.
Residue:
405
  
Inhibitor
Name:
BDBM50195294
Synonyms:
4-({1-[4-(5-trifluoromethyl-pyridin-2-yl)-piperazin-1-yl]-cyclopropanecarbonyl}-amino)-adamantane-1-carboxylic acid | CHEMBL220883
Type:
Small organic molecule
Emp. Form.:
C25H31F3N4O3
Mol. Mass.:
492.5338
SMILES:
OC(=O)[C@@]12C[C@H]3CC(C1)[C@H](NC(=O)C1(CC1)N1CCN(CC1)c1ccc(cn1)C(F)(F)F)C(C3)C2
: