Target
11-beta-hydroxysteroid dehydrogenase 1
Ligand
BDBM50195294
Substrate
Meas. Tech.
ChEMBL_424850 (CHEMBL907400)
IC50
45±n/a nM
Citation
 Sorensen, BRohde, JWang, JFung, SMonzon, KChiou, WPan, LDeng, XStolarik, DFrevert, EUJacobson, PLink, JT Adamantane 11-beta-HSD-1 inhibitors: Application of an isocyanide multicomponent reaction. Bioorg Med Chem Lett 16:5958-62 (2006)  
Target
Name:
11-beta-hydroxysteroid dehydrogenase 1
Synonyms:
11-DH 11-beta-Hydroxysteroid Dehydrogenase 1 (11-beta-HSD1) 11-beta-hydroxysteroid dehydrogenase 1 (11HSD1) Corticosteroid 11-beta-dehydrogenase isozyme 1 (11-beta-HSD-1) Corticosteroid 11-beta-dehydrogenase isozyme 1 (11beta-HSD1) HSD11 HSD11L | SDR26C1
Type:
Enzyme
Mol. Mass.:
32409.16
Organism:
Homo sapiens (Human)
Description:
P28845
Residue:
292
  
Inhibitor
Name:
BDBM50195294
Synonyms:
4-({1-[4-(5-trifluoromethyl-pyridin-2-yl)-piperazin-1-yl]-cyclopropanecarbonyl}-amino)-adamantane-1-carboxylic acid | CHEMBL220883
Type:
Small organic molecule
Emp. Form.:
C25H31F3N4O3
Mol. Mass.:
492.5338
SMILES:
OC(=O)[C@@]12C[C@H]3CC(C1)[C@H](NC(=O)C1(CC1)N1CCN(CC1)c1ccc(cn1)C(F)(F)F)C(C3)C2
: