Target
11-beta-hydroxysteroid dehydrogenase type 2
Ligand
BDBM50197413
Substrate
Meas. Tech.
ChEMBL_453206 (CHEMBL902360)
IC50
17000±n/a nM
Citation
 Sorensen, BWinn, MRohde, JShuai, QWang, JFung, SMonzon, KChiou, WStolarik, DImade, HPan, LDeng, XChovan, LLongenecker, KJudge, RQin, WBrune, MCamp, HFrevert, EUJacobson, PLink, JT Adamantane sulfone and sulfonamide 11-beta-HSD1 Inhibitors. Bioorg Med Chem Lett 17:527-32 (2007)  
Target
Name:
11-beta-hydroxysteroid dehydrogenase type 2
Synonyms:
11-DH2 11-beta-Hydroxysteroid Dehydrogenase 2 (11-beta-HSD2) 11-beta-hydroxysteroid dehydrogenase 2 11-beta-hydroxysteroid dehydrogenase type 2 (11-beta-HSD2) DHI2_HUMAN HSD11K SDR9C3
Type:
Enzyme
Mol. Mass.:
44141.72
Organism:
Homo sapiens (Human)
Description:
Purified recombinant human 11beta-HSD2.
Residue:
405
  
Inhibitor
Name:
BDBM50197413
Synonyms:
2-(3-chloro-phenoxy)-N-(5-methanesulfonyl-adamantan-2-yl)-2-methyl-propionamide | CHEMBL241714
Type:
Small organic molecule
Emp. Form.:
C21H28ClNO4S
Mol. Mass.:
425.969
SMILES:
CC(C)(Oc1cccc(Cl)c1)C(=O)N[C@H]1C2CC3CC1C[C@](C3)(C2)S(C)(=O)=O
: