Target
Integrin alpha-4/beta-1
Ligand
BDBM50198924
Substrate
Meas. Tech.
ChEMBL_441017 (CHEMBL890104)
IC50
54±n/a nM
Citation
 Chang, LLTruong, QDoss, GAMacCoss, MLyons, KMcCauley, EMumford, RForrest, GVincent, SSchmidt, JAHagmann, WK Highly constrained bicyclic VLA-4 antagonists. Bioorg Med Chem Lett 17:597-601 (2007)  
Target
Name:
Integrin alpha-4/beta-1
Synonyms:
Fibronectin receptor beta/Integrin alpha-4 | Integrin alpha-4/beta-1
Type:
Mol. Mass.:
Description:
ASSAY_ID of EBI is 88912
Components:
This complex has 2 components.
Component 1
Name:
Integrin beta-1
Synonyms:
CD_antigen=CD29 Fibronectin receptor beta GPIIA ITGB1 MDF2 | MSK12
Type:
Enzyme
Mol. Mass.:
88400.38
Organism:
Homo sapiens (Human)
Description:
P05556
Residue:
798
  
Component 2
Name:
Integrin alpha-4
Synonyms:
CD49 antigen-like family member D CD49d antigen ITA4_HUMAN Integrin alpha-4 Integrin alpha-IV VLA-4 integrin alpha 4 precursor | integrin alpha-4 precursor
Type:
Membrane Protein
Mol. Mass.:
114897.35
Organism:
Homo sapiens (Human)
Description:
P13612
Residue:
1032
  
Inhibitor
Name:
BDBM50198924
Synonyms:
(2S,3S)-3-((S)-1-(3,5-dichlorophenylsulfonyl)pyrrolidine-2-carboxamido)bicyclo[2.2.1]heptane-2-carboxylic acid | CHEMBL232263
Type:
Small organic molecule
Emp. Form.:
C19H22Cl2N2O5S
Mol. Mass.:
461.359
SMILES:
OC(=O)[C@H]1C2CCC(C2)[C@@H]1NC(=O)[C@@H]1CCCN1S(=O)(=O)c1cc(Cl)cc(Cl)c1
: