Target
5-hydroxytryptamine receptor 1B
Ligand
BDBM50199566
Substrate
Meas. Tech.
ChEMBL_432902 (CHEMBL915028)
Ki
3.5±n/a nM
Citation
 Horchler, CLMcCauley, JPHall, JESnyder, DHCraig Moore, WHudzik, TJChapdelaine, MJ Synthesis of novel quinolone and quinoline-2-carboxylic acid (4-morpholin-4-yl-phenyl)amides: a late-stage diversification approach to potent 5HT1B antagonists. Bioorg Med Chem 15:939-50 (2006)  
Target
Name:
5-hydroxytryptamine receptor 1B
Synonyms:
5-HT-1B 5-HT1B 5HT1B_HUMAN HTR1DB Serotonin (5-HT) receptor Serotonin Receptor 1B
Type:
G Protein-Coupled Receptor (GPCR)
Mol. Mass.:
43579.17
Organism:
Homo sapiens (Human)
Description:
Receptor binding assays were performed using human clone stably expressed in CHO cells
Residue:
390
  
Inhibitor
Name:
BDBM50199566
Synonyms:
6-methoxy-8-(4-methyl-piperazin-1-yl)-4-oxo-1,4-dihydroquinoline-2-carboxylic acid (4-morpholin-4-ylphenyl)amide | CHEMBL224399
Type:
Small organic molecule
Emp. Form.:
C26H31N5O4
Mol. Mass.:
477.5554
SMILES:
COc1cc(N2CCN(C)CC2)c2nc(cc(O)c2c1)C(=O)Nc1ccc(cc1)N1CCOCC1
: