Target
Adenosine kinase
Ligand
BDBM50201845
Substrate
Meas. Tech.
ChEMBL_435461 (CHEMBL903819)
IC50
1000±n/a nM
Citation
 Matulenko, MAPaight, ESFrey, RRGomtsyan, ADiDomenico, SJiang, MLee, CHStewart, AOYu, HKohlhaas, KLAlexander, KMMcGaraughty, SMikusa, JMarsh, KCMuchmore, SWJakob, CLKowaluk, EAJarvis, MFBhagwat, SS 4-amino-5-aryl-6-arylethynylpyrimidines: structure-activity relationships of non-nucleoside adenosine kinase inhibitors. Bioorg Med Chem 15:1586-605 (2007)  
Target
Name:
Adenosine kinase
Synonyms:
ADK | ADK_HUMAN
Type:
PROTEIN
Mol. Mass.:
40545.97
Organism:
Homo sapiens (Human)
Description:
ChEMBL_1467841
Residue:
362
  
Inhibitor
Name:
BDBM50201845
Synonyms:
5-benzyl-6-(4-dimethylaminophenylethynyl)pyrimidin-4-ylamine | CHEMBL226393
Type:
Small organic molecule
Emp. Form.:
C21H20N4
Mol. Mass.:
328.4103
SMILES:
CN(C)c1ccc(cc1)C#Cc1ncnc(N)c1Cc1ccccc1
: