Target
Adenosine kinase
Ligand
BDBM50201829
Substrate
Meas. Tech.
ChEMBL_435462 (CHEMBL903820)
IC50
>1000±n/a nM
Citation
 Matulenko, MAPaight, ESFrey, RRGomtsyan, ADiDomenico, SJiang, MLee, CHStewart, AOYu, HKohlhaas, KLAlexander, KMMcGaraughty, SMikusa, JMarsh, KCMuchmore, SWJakob, CLKowaluk, EAJarvis, MFBhagwat, SS 4-amino-5-aryl-6-arylethynylpyrimidines: structure-activity relationships of non-nucleoside adenosine kinase inhibitors. Bioorg Med Chem 15:1586-605 (2007)  
Target
Name:
Adenosine kinase
Synonyms:
ADK | ADK_HUMAN
Type:
PROTEIN
Mol. Mass.:
40545.97
Organism:
Homo sapiens (Human)
Description:
ChEMBL_1467841
Residue:
362
  
Inhibitor
Name:
BDBM50201829
Synonyms:
6-(4-dimethylaminophenylethynyl)-5-(4-isopropylphenyl)pyrimidin-4-ylamine | CHEMBL225705
Type:
Small organic molecule
Emp. Form.:
C23H24N4
Mol. Mass.:
356.4635
SMILES:
CC(C)c1ccc(cc1)-c1c(N)ncnc1C#Cc1ccc(cc1)N(C)C
: