Target
Serine/threonine-protein kinase Chk1
Ligand
BDBM50204697
Substrate
Meas. Tech.
ChEMBL_442101 (CHEMBL891239)
EC50
>10000±n/a nM
Citation
 Tong, YClaiborne, AStewart, KDPark, CKovar, PChen, ZCredo, RBGu, WZGwaltney, SLJudge, RAZhang, HRosenberg, SHSham, HLSowin, TJLin, NH Discovery of 1,4-dihydroindeno[1,2-c]pyrazoles as a novel class of potent and selective checkpoint kinase 1 inhibitors. Bioorg Med Chem 15:2759-67 (2007)  
Target
Name:
Serine/threonine-protein kinase Chk1
Synonyms:
CHEK1 CHK1 checkpoint homolog Checkpoint kinase-1 (CHK1)
Type:
Enzyme Catalytic Domain
Mol. Mass.:
54443.02
Organism:
Homo sapiens (Human)
Description:
gi_166295192
Residue:
476
  
Inhibitor
Name:
BDBM50204697
Synonyms:
4'-{6-[(trans-4-hydroxy-cyclohexylamino)-methyl]-1,4-dihydro-indeno[1,2-c]pyrazol-3-yl}-biphenyl-4-ol | CHEMBL242535
Type:
Small organic molecule
Emp. Form.:
C29H29N3O2
Mol. Mass.:
451.5595
SMILES:
O[C@H]1CC[C@@H](CC1)NCc1ccc-2c(Cc3c(n[nH]c-23)-c2ccc(cc2)-c2ccc(O)cc2)c1
: