Target
Phospholipase D2
Ligand
BDBM50206154
Substrate
Meas. Tech.
ChEMBL_454676 (CHEMBL886696)
IC50
1500±n/a nM
Citation
 Monovich, LMugrage, BQuadros, EToscano, KTommasi, RLaVoie, SLiu, EDu, ZLaSala, DBoyar, WSteed, P Optimization of halopemide for phospholipase D2 inhibition. Bioorg Med Chem Lett 17:2310-1 (2007)  
Target
Name:
Phospholipase D2
Synonyms:
PLD2 Phospholipase D2 phospholipase D2 isoform PLD2A
Type:
Protein
Mol. Mass.:
106002.47
Organism:
Homo sapiens (Human)
Description:
Residue:
933
  
Inhibitor
Name:
BDBM50206154
Synonyms:
CHEMBL245623 | N-(2-(4-(2-oxo-2,3-dihydrobenzo[d]imidazol-1-yl)piperidin-1-yl)ethyl)benzamide
Type:
Small organic molecule
Emp. Form.:
C21H24N4O2
Mol. Mass.:
364.4409
SMILES:
O=C(NCCN1CCC(CC1)n1c2ccccc2[nH]c1=O)c1ccccc1
: