Target
Phospholipase D2
Ligand
BDBM50206160
Substrate
Meas. Tech.
ChEMBL_454676 (CHEMBL886696)
IC50
1500±n/a nM
Citation
 Monovich, LMugrage, BQuadros, EToscano, KTommasi, RLaVoie, SLiu, EDu, ZLaSala, DBoyar, WSteed, P Optimization of halopemide for phospholipase D2 inhibition. Bioorg Med Chem Lett 17:2310-1 (2007)  
Target
Name:
Phospholipase D2
Synonyms:
PLD2 Phospholipase D2 phospholipase D2 isoform PLD2A
Type:
Protein
Mol. Mass.:
106002.47
Organism:
Homo sapiens (Human)
Description:
Residue:
933
  
Inhibitor
Name:
BDBM50206160
Synonyms:
CHEMBL245621 Halopemide, 8 N-(2-(4-(5-chloro-2-oxo-2,3-dihydrobenzo[d]imidazol-1-yl)piperidin-1-yl)ethyl)-4-fluorobenzamide | cid_65490
Type:
Small organic molecule
Emp. Form.:
C21H22ClFN4O2
Mol. Mass.:
416.876
SMILES:
Fc1ccc(cc1)C(=O)NCCN1CCC(CC1)n1c2ccc(Cl)cc2[nH]c1=O
: