Target
Chymase
Ligand
BDBM50208236
Substrate
Meas. Tech.
ChEMBL_429291 (CHEMBL915852)
IC50
10±n/a nM
Citation
 Greco, MNHawkins, MJPowell, ETAlmond, HRde Garavilla, LHall, JMinor, LKWang, YCorcoran, TWDi Cera, ECantwell, AMSavvides, SNDamiano, BPMaryanoff, BE Discovery of potent, selective, orally active, nonpeptide inhibitors of human mast cell chymase. J Med Chem 50:1727-30 (2007)  
Target
Name:
Chymase
Synonyms:
Alpha-chymase CMA1_HUMAN CYM Mast cell protease I
Type:
Enzyme
Mol. Mass.:
27340.12
Organism:
Homo sapiens (Human)
Description:
Residue:
247
  
Inhibitor
Name:
BDBM50208236
Synonyms:
1-(5-chloro-1-methyl-1H-indol-3-yl)-2-(naphthalen-2-ylamino)-2-oxoethyl(methyl)phosphinic acid | CHEMBL374087
Type:
Small organic molecule
Emp. Form.:
C22H20ClN2O3P
Mol. Mass.:
426.833
SMILES:
Cn1cc(C(C(=O)Nc2ccc3ccccc3c2)P(C)(O)=O)c2cc(Cl)ccc12
: