Target
Chymase
Ligand
BDBM50208228
Substrate
Meas. Tech.
ChEMBL_429291 (CHEMBL915852)
Ki
36±n/a nM
Citation
 Greco, MNHawkins, MJPowell, ETAlmond, HRde Garavilla, LHall, JMinor, LKWang, YCorcoran, TWDi Cera, ECantwell, AMSavvides, SNDamiano, BPMaryanoff, BE Discovery of potent, selective, orally active, nonpeptide inhibitors of human mast cell chymase. J Med Chem 50:1727-30 (2007)  
Target
Name:
Chymase
Synonyms:
Alpha-chymase CMA1_HUMAN CYM Mast cell protease I
Type:
Enzyme
Mol. Mass.:
27340.12
Organism:
Homo sapiens (Human)
Description:
Residue:
247
  
Inhibitor
Name:
BDBM50208228
Synonyms:
1-(5-chlorobenzo[b]thiophen-3-yl)-2-(naphthalen-2-ylamino)-2-oxoethylphosphonic acid | CHEMBL387130
Type:
Small organic molecule
Emp. Form.:
C20H15ClNO4PS
Mol. Mass.:
431.829
SMILES:
OP(O)(=O)C(C(=O)Nc1ccc2ccccc2c1)c1csc2ccc(Cl)cc12
: