Target
P2Y purinoceptor 1
Ligand
BDBM50215401
Substrate
Meas. Tech.
ChEMBL_439405 (CHEMBL888518)
IC50
1549±n/a nM
Citation
 Costanzi, STikhonova, IGOhno, MRoh, EJJoshi, BVColson, AOHouston, DMaddileti, SHarden, TKJacobson, KA P2Y1 antagonists: combining receptor-based modeling and QSAR for a quantitative prediction of the biological activity based on consensus scoring. J Med Chem 50:3229-41 (2007)  
Target
Name:
P2Y purinoceptor 1
Synonyms:
ATP receptor P2RY1_HUMAN P2Y1 Purinergic receptor P2Y1
Type:
Enzyme
Mol. Mass.:
42090.25
Organism:
Homo sapiens (Human)
Description:
P47900
Residue:
373
  
Inhibitor
Name:
BDBM50215401
Synonyms:
(1'R,2'S,4'S,5'S)-phosphoric acid mono-[1-hydroxymethyl-4-(2-iodo-6-methylaminopurin-9-yl)-bicyclo[3.1.0]hex-2-yl] ester | CHEMBL375022
Type:
Small organic molecule
Emp. Form.:
C13H17IN5O5P
Mol. Mass.:
481.1828
SMILES:
CNc1nc(I)nc2n(cnc12)[C@H]1C[C@H](OP(O)(O)=O)[C@]2(CO)C[C@H]12
: