Target
Sodium- and chloride-dependent glycine transporter 1
Ligand
BDBM50218009
Substrate
Meas. Tech.
ChEMBL_456972 (CHEMBL924334)
IC50
70±n/a nM
Citation
 Walter, MWHoffman, BJGordon, KJohnson, KLove, PJones, MMan, TPhebus, LReel, JKRudyk, HCShannon, HSvensson, KYu, HValli, MJPorter, WJ Discovery and SAR studies of novel GlyT1 inhibitors. Bioorg Med Chem Lett 17:5233-8 (2007)  
Target
Name:
Sodium- and chloride-dependent glycine transporter 1
Synonyms:
GlyT-1 Glycine Transporters (GlyT1c) SC6A9_HUMAN Sodium- and chloride-dependent glycine transporter 1 Sodium- and chloride-dependent glycine transporter 1 (GlyT1c) Solute carrier family 6 member 9
Type:
Enzyme
Mol. Mass.:
78270.54
Organism:
Homo sapiens (Human)
Description:
P48067
Residue:
706
  
Inhibitor
Name:
BDBM50218009
Synonyms:
CHEMBL250581 | {[2-(3-cyclohexanecarbonyl-biphenyl-4-yloxy)-ethyl]-methyl-amino}-acetic acid
Type:
Small organic molecule
Emp. Form.:
C24H29NO4
Mol. Mass.:
395.4914
SMILES:
CN(CCOc1ccc(cc1C(=O)C1CCCCC1)-c1ccccc1)CC(O)=O
: