Target
Progesterone receptor
Ligand
BDBM50220388
Substrate
Meas. Tech.
ChEMBL_449235 (CHEMBL899497)
IC50
9460±n/a nM
Citation
 Van Camp, JAHu, LYKostlan, CLefker, BLi, JMitchell, LWang, ZYue, WSCarroll, MDettling, DDu, DPocalyko, DWade, K Preparation of 4-aryl-2-trifluoromethylbenzonitrile derivatives as androgen receptor antagonists for topical suppression of sebum production. Bioorg Med Chem Lett 17:5529-32 (2007)  
Target
Name:
Progesterone receptor
Synonyms:
NR3C3 PGR PRGR_HUMAN | progesterone
Type:
Protein
Mol. Mass.:
98979.52
Organism:
Homo sapiens (Human)
Description:
P06401
Residue:
933
  
Inhibitor
Name:
BDBM50220388
Synonyms:
3'-methoxy-3-trifluoromethyl-biphenyl-4-carbonitrile | CHEMBL443579
Type:
Small organic molecule
Emp. Form.:
C15H10F3NO
Mol. Mass.:
277.2412
SMILES:
COc1cccc(c1)-c1ccc(C#N)c(c1)C(F)(F)F
: