Target
Androgen receptor
Ligand
BDBM50220643
Substrate
Meas. Tech.
ChEMBL_457373 (CHEMBL940964)
IC50
>1000±n/a nM
Citation
 Hu, LYLei, HJDu, DJohnson, TRFedij, VKostlan, CYue, WSLovdahl, MLi, JJCarroll, MDettling, DAsbill, JFan, CWade, KPocalyko, DLapham, KYalamanchili, RSamas, BVrieze, DCiotti, SKrieger-Burke, TSliskovic, DWelgus, H Synthesis and biological evaluation of amino-pyridines as androgen receptor antagonists for stimulating hair growth and reducing sebum production. Bioorg Med Chem Lett 17:5693-7 (2007)  
Target
Name:
Androgen receptor
Synonyms:
ANDR_HUMAN Androgen Receptor Androgen receptor/Baculoviral IAP repeat-containing protein 2 Dihydrotestosterone receptor Nuclear receptor subfamily 3 group C member 4
Type:
Receptor
Mol. Mass.:
99185.27
Organism:
Homo sapiens (Human)
Description:
CHO cells were stably transfected with human AR gene.
Residue:
920
  
Inhibitor
Name:
BDBM50220643
Synonyms:
6-((cyclopropylmethyl)(propyl)amino)-4-(trifluoromethyl)nicotinonitrile | CHEMBL398431
Type:
Small organic molecule
Emp. Form.:
C14H16F3N3
Mol. Mass.:
283.2921
SMILES:
CCCN(CC1CC1)c1cc(c(cn1)C#N)C(F)(F)F
: