Target
Histamine H3 receptor
Ligand
BDBM50139391
Substrate
Meas. Tech.
ChEMBL_450591 (CHEMBL900877)
EC50
1.29±n/a nM
Citation
 Altenbach, RJLiu, HBanfor, PNBrowman, KEFox, GBFryer, RMKomater, VAKrueger, KMMarsh, KMiller, TRPan, JBPan, LSun, MThiffault, CWetter, JZhao, CZhou, DEsbenshade, TAHancock, AACowart, MD Synthesis, potency, and in vivo profiles of quinoline containing histamine H3 receptor inverse agonists. J Med Chem 50:5439-48 (2007)  
Target
Name:
Histamine H3 receptor
Synonyms:
G-protein coupled receptor 97 HH3R HRH3 Histamine H3 receptor (H3) Histamine receptor (H3 and H4)
Type:
G Protein-Coupled Receptor (GPCR)
Mol. Mass.:
48691.47
Organism:
Homo sapiens (Human)
Description:
Binding assays were using CHO cells stably expressing hH3R receptors.
Residue:
445
  
Inhibitor
Name:
BDBM50139391
Synonyms:
(R)-4-(2-(2-(2-methylpyrrolidin-1-yl)ethyl)benzofuran-5-yl)benzonitrile ABT-239 | CHEMBL351231
Type:
Small organic molecule
Emp. Form.:
C22H22N2O
Mol. Mass.:
330.4229
SMILES:
C[C@@H]1CCCN1CCc1cc2cc(ccc2o1)-c1ccc(cc1)C#N
: