Target
Histamine H3 receptor
Ligand
BDBM50224188
Substrate
Meas. Tech.
ChEMBL_450591 (CHEMBL900877)
EC50
1.58±n/a nM
Citation
 Altenbach, RJLiu, HBanfor, PNBrowman, KEFox, GBFryer, RMKomater, VAKrueger, KMMarsh, KMiller, TRPan, JBPan, LSun, MThiffault, CWetter, JZhao, CZhou, DEsbenshade, TAHancock, AACowart, MD Synthesis, potency, and in vivo profiles of quinoline containing histamine H3 receptor inverse agonists. J Med Chem 50:5439-48 (2007)  
Target
Name:
Histamine H3 receptor
Synonyms:
G-protein coupled receptor 97 HH3R HRH3 Histamine H3 receptor (H3) Histamine receptor (H3 and H4)
Type:
G Protein-Coupled Receptor (GPCR)
Mol. Mass.:
48691.47
Organism:
Homo sapiens (Human)
Description:
Binding assays were using CHO cells stably expressing hH3R receptors.
Residue:
445
  
Inhibitor
Name:
BDBM50224188
Synonyms:
(R)-2-methyl-3-(6-(2-(2-methylpyrrolidin-1-yl)ethyl)quinolin-2-yl)-1,8-naphthyridine CHEMBL263101
Type:
Small organic molecule
Emp. Form.:
C25H26N4
Mol. Mass.:
382.5007
SMILES:
C[C@@H]1CCCN1CCc1ccc2nc(ccc2c1)-c1cc2cccnc2nc1C
: