Target
Stromelysin-1
Ligand
BDBM50227987
Substrate
Meas. Tech.
ChEMBL_461666 (CHEMBL927687)
IC50
>5000±n/a nM
Citation
 Yao, WZhuo, JBurns, DMLi, YLQian, DQZhang, CHe, CXu, MShi, ELi, YMarando, CACovington, MBYang, GLiu, XPan, MFridman, JSScherle, PWasserman, ZRHollis, GVaddi, KYeleswaram, SNewton, RFriedman, SMetcalf, B Design and identification of selective HER-2 sheddase inhibitors via P1' manipulation and unconventional P2' perturbations to induce a molecular metamorphosis. Bioorg Med Chem Lett 18:159-63 (2008)  
Target
Name:
Stromelysin-1
Synonyms:
MMP-3 MMP3_HUMAN Matrix metalloproteinase 3 Matrix metalloproteinase-3 (MMP-3) SL-1 Stromelysin 1 | Transin-1
Type:
Enzyme
Mol. Mass.:
53973.13
Organism:
Homo sapiens (Human)
Description:
P08254
Residue:
477
  
Inhibitor
Name:
BDBM50227987
Synonyms:
(6S,7S)-6-[4-(3,5-dimethyl-phenyl)-3,6-dihydro-2H-pyridine-1-carbonyl]-5-aza-spiro[2.5]octane-7-carboxylic acid hydroxyamide | CHEMBL252278
Type:
Small organic molecule
Emp. Form.:
C22H29N3O3
Mol. Mass.:
383.484
SMILES:
Cc1cc(C)cc(c1)C1=CCN(CC1)C(=O)[C@H]1NCC2(CC2)C[C@@H]1C(=O)NO
: