Target
Potassium voltage-gated channel subfamily H member 2
Ligand
BDBM50243845
Substrate
Meas. Tech.
ChEMBL_492219 (CHEMBL952419)
IC50
135±n/a nM
Citation
 Shipe, WDBarrow, JCYang, ZQLindsley, CWYang, FVSchlegel, KAShu, YRittle, KEBock, MGHartman, GDTang, CBallard, JEKuo, YAdarayan, EDPrueksaritanont, TZrada, MMUebele, VNNuss, CEConnolly, TMDoran, SMFox, SVKraus, RLMarino, MJGraufelds, VKVargas, HMBunting, PBHasbun-Manning, MEvans, RMKoblan, KSRenger, JJ Design, synthesis, and evaluation of a novel 4-aminomethyl-4-fluoropiperidine as a T-type Ca2+ channel antagonist. J Med Chem 51:3692-5 (2008)  
Target
Name:
Potassium voltage-gated channel subfamily H member 2
Synonyms:
1,3-beta-glucan synthase component GLS2 ERG Eag-related protein 1 Ether-a-go-go-related gene (HERG) Ether-a-go-go-related gene potassium channel 1 Ether-a-go-go-related gene potassium channel 1 (hERG1) Ether-a-go-go-related protein 1 H-ERG KCNH2 Potassium voltage-gated channel subfamily H member 2 (hERG) Voltage-gated potassium channel subunit Kv11.1 hERG Potassium Channel 1 | putative potassium channel subunit
Type:
Multi-pass membrane protein
Mol. Mass.:
126672.65
Organism:
Homo sapiens (Human)
Description:
Q12809
Residue:
1159
  
Inhibitor
Name:
BDBM50243845
Synonyms:
3,5-Dichloro-N-[1-(4-methyl-benzyl)-piperidin-4-ylmethyl]-benzamide | CHEMBL488295
Type:
Small organic molecule
Emp. Form.:
C21H24Cl2N2O
Mol. Mass.:
391.334
SMILES:
Cc1ccc(CN2CCC(CNC(=O)c3cc(Cl)cc(Cl)c3)CC2)cc1
: