Target
Sodium channel protein type 5 subunit alpha
Ligand
BDBM50243805
Substrate
Meas. Tech.
ChEMBL_492230 (CHEMBL939609)
IC50
84000±n/a nM
Citation
 Shipe, WDBarrow, JCYang, ZQLindsley, CWYang, FVSchlegel, KAShu, YRittle, KEBock, MGHartman, GDTang, CBallard, JEKuo, YAdarayan, EDPrueksaritanont, TZrada, MMUebele, VNNuss, CEConnolly, TMDoran, SMFox, SVKraus, RLMarino, MJGraufelds, VKVargas, HMBunting, PBHasbun-Manning, MEvans, RMKoblan, KSRenger, JJ Design, synthesis, and evaluation of a novel 4-aminomethyl-4-fluoropiperidine as a T-type Ca2+ channel antagonist. J Med Chem 51:3692-5 (2008)  
Target
Name:
Sodium channel protein type 5 subunit alpha
Synonyms:
HH1 SCN5A_HUMAN Sodium channel protein type 5 subunit alpha/beta-1/beta-2 Voltage-gated sodium channel subunit alpha Nav1.5
Type:
Enzyme
Mol. Mass.:
226908.60
Organism:
Homo sapiens (Human)
Description:
Q14524
Residue:
2016
  
Inhibitor
Name:
BDBM50243805
Synonyms:
(S)-3,5-Dichloro-N-[1-(2,2-dimethyl-tetrahydro-pyran-4-ylmethyl)-4-fluoro-piperidin-4-ylmethyl]-benzamide CHEMBL488817
Type:
Small organic molecule
Emp. Form.:
C21H29Cl2FN2O2
Mol. Mass.:
431.372
SMILES:
CC1(C)C[C@@H](CN2CCC(F)(CNC(=O)c3cc(Cl)cc(Cl)c3)CC2)CCO1
: