Target
Gonadotropin-releasing hormone receptor
Ligand
BDBM50272669
Substrate
Meas. Tech.
ChEMBL_510057 (CHEMBL995200)
Ki
98±n/a nM
Citation
 Regan, CFGuo, ZChen, YHuang, CQChen, MJiang, WRueter, JKCoon, TChen, CSaunders, JBrown, MSBetz, SFStruthers, RSYang, CWen, JMadan, AZhu, YF Zwitterionic uracil derivatives as potent GnRH receptor antagonists with improved pharmaceutical properties. Bioorg Med Chem Lett 18:4503-7 (2008)  
Target
Name:
Gonadotropin-releasing hormone receptor
Synonyms:
GNRHR GRHR GnRH-R Gonadotropin-releasing hormone receptor | Gonadotropin-releasing hormone receptor (GnRH)
Type:
Enzyme
Mol. Mass.:
37749.45
Organism:
Homo sapiens (Human)
Description:
P30968
Residue:
328
  
Inhibitor
Name:
BDBM50272669
Synonyms:
(R)-2-((2-(3-(1-(2-fluoro-6-(trifluoromethyl)benzyl)-6-methyl-3-(2-(methylamino)-2-phenylethyl)-2,4-dioxo-1,2,3,4-tetrahydropyrimidin-5-yl)-2-fluorophenoxy)ethyl)(methyl)amino)acetic acid | CHEMBL452198
Type:
Small organic molecule
Emp. Form.:
C33H33F5N4O5
Mol. Mass.:
660.6309
SMILES:
CN[C@@H](Cn1c(=O)c(c(C)n(Cc2c(F)cccc2C(F)(F)F)c1=O)-c1cccc(OCCN(C)CC(O)=O)c1F)c1ccccc1
: