Target
Histone deacetylase 2
Ligand
BDBM50268063
Substrate
Meas. Tech.
ChEMBL_521104 (CHEMBL960365)
IC50
2.5±n/a nM
Citation
 Andrianov, VGailite, VLola, DLoza, ESemenikhina, VKalvinsh, IFinn, PPetersen, KDRitchie, JWKhan, NTumber, ACollins, LSVadlamudi, SMBjörkling, FSehested, M Novel amide derivatives as inhibitors of histone deacetylase: design, synthesis and SAR. Eur J Med Chem 44:1067-85 (2009)  
Target
Name:
Histone deacetylase 2
Synonyms:
Cereblon/Histone deacetylase 2 HDAC2 Histone deacetylase 2 (HDAC2) | Human HDAC2
Type:
Chromatin regulator; hydrolase; repressor
Mol. Mass.:
55356.54
Organism:
Homo sapiens (Human)
Description:
Q92769
Residue:
488
  
Inhibitor
Name:
BDBM50268063
Synonyms:
(E)-N-[6-(Hydroxyamino)-6-oxohexyl]-3-(7-quinolinyl)-2-propenamide | CHEMBL484073
Type:
Small organic molecule
Emp. Form.:
C18H21N3O3
Mol. Mass.:
327.3776
SMILES:
ONC(=O)CCCCCNC(=O)\C=C\c1ccc2cccnc2c1
: