Target
Histone deacetylase 3
Ligand
BDBM50268042
Substrate
Meas. Tech.
ChEMBL_521105 (CHEMBL960366)
IC50
5.3±n/a nM
Citation
 Andrianov, VGailite, VLola, DLoza, ESemenikhina, VKalvinsh, IFinn, PPetersen, KDRitchie, JWKhan, NTumber, ACollins, LSVadlamudi, SMBjörkling, FSehested, M Novel amide derivatives as inhibitors of histone deacetylase: design, synthesis and SAR. Eur J Med Chem 44:1067-85 (2009)  
Target
Name:
Histone deacetylase 3
Synonyms:
HD3 HDAC3_HUMAN Human HDAC3 SMAP45
Type:
Enzyme
Mol. Mass.:
48829.55
Organism:
Homo sapiens (Human)
Description:
O15379
Residue:
428
  
Inhibitor
Name:
BDBM50268042
Synonyms:
(2E,4E)-N-[6-(Hydroxyamino)-6-oxohexyl]-3-methyl-5-phenyl-2,4-pentadienamide | CHEMBL490018
Type:
Small organic molecule
Emp. Form.:
C18H24N2O3
Mol. Mass.:
316.3948
SMILES:
C\C(\C=C\c1ccccc1)=C/C(=O)NCCCCCC(=O)NO
: