Target
Histone deacetylase 3
Ligand
BDBM50268063
Substrate
Meas. Tech.
ChEMBL_521105 (CHEMBL960366)
IC50
6.7±n/a nM
Citation
 Andrianov, VGailite, VLola, DLoza, ESemenikhina, VKalvinsh, IFinn, PPetersen, KDRitchie, JWKhan, NTumber, ACollins, LSVadlamudi, SMBjörkling, FSehested, M Novel amide derivatives as inhibitors of histone deacetylase: design, synthesis and SAR. Eur J Med Chem 44:1067-85 (2009)  
Target
Name:
Histone deacetylase 3
Synonyms:
HD3 HDAC3_HUMAN Human HDAC3 SMAP45
Type:
Enzyme
Mol. Mass.:
48829.55
Organism:
Homo sapiens (Human)
Description:
O15379
Residue:
428
  
Inhibitor
Name:
BDBM50268063
Synonyms:
(E)-N-[6-(Hydroxyamino)-6-oxohexyl]-3-(7-quinolinyl)-2-propenamide | CHEMBL484073
Type:
Small organic molecule
Emp. Form.:
C18H21N3O3
Mol. Mass.:
327.3776
SMILES:
ONC(=O)CCCCCNC(=O)\C=C\c1ccc2cccnc2c1
: