Target
Histone deacetylase 4
Ligand
BDBM50268097
Substrate
Meas. Tech.
ChEMBL_521106 (CHEMBL960367)
IC50
1.2±n/a nM
Citation
 Andrianov, VGailite, VLola, DLoza, ESemenikhina, VKalvinsh, IFinn, PPetersen, KDRitchie, JWKhan, NTumber, ACollins, LSVadlamudi, SMBjörkling, FSehested, M Novel amide derivatives as inhibitors of histone deacetylase: design, synthesis and SAR. Eur J Med Chem 44:1067-85 (2009)  
Target
Name:
Histone deacetylase 4
Synonyms:
Cereblon/Histone deacetylase 4 HDAC4 Histone acetylase 4(HDAC4) KIAA0288
Type:
Enzyme
Mol. Mass.:
119049.39
Organism:
Homo sapiens (Human)
Description:
P56524
Residue:
1084
  
Inhibitor
Name:
BDBM50268097
Synonyms:
6-{[2-(9H-Fluoren-9-yliden)acetyl]amino}-N-hydroxyhexanamide | CHEMBL485514
Type:
Small organic molecule
Emp. Form.:
C21H22N2O3
Mol. Mass.:
350.411
SMILES:
[#8]-[#7]-[#6](=O)-[#6]-[#6]-[#6]-[#6]-[#6]-[#7]-[#6](=O)\[#6]=[#6]-1\c2ccccc2-c2ccccc-12
: