Target
Histone deacetylase 6
Ligand
BDBM50268063
Substrate
Meas. Tech.
ChEMBL_521108 (CHEMBL960369)
IC50
3.4±n/a nM
Citation
 Andrianov, VGailite, VLola, DLoza, ESemenikhina, VKalvinsh, IFinn, PPetersen, KDRitchie, JWKhan, NTumber, ACollins, LSVadlamudi, SMBjörkling, FSehested, M Novel amide derivatives as inhibitors of histone deacetylase: design, synthesis and SAR. Eur J Med Chem 44:1067-85 (2009)  
Target
Name:
Histone deacetylase 6
Synonyms:
Cereblon/Histone deacetylase 6 HDAC6 Histone deacetylase 6 (HDAC6) KIAA0901 | ORF Names:JM21
Type:
Chromatin regulator; hydrolase; repressor
Mol. Mass.:
131381.51
Organism:
Homo sapiens (Human)
Description:
Q9UBN7
Residue:
1215
  
Inhibitor
Name:
BDBM50268063
Synonyms:
(E)-N-[6-(Hydroxyamino)-6-oxohexyl]-3-(7-quinolinyl)-2-propenamide | CHEMBL484073
Type:
Small organic molecule
Emp. Form.:
C18H21N3O3
Mol. Mass.:
327.3776
SMILES:
ONC(=O)CCCCCNC(=O)\C=C\c1ccc2cccnc2c1
: