Target
Histone deacetylase 7
Ligand
BDBM50268121
Substrate
Meas. Tech.
ChEMBL_521109 (CHEMBL960370)
IC50
6.3±n/a nM
Citation
 Andrianov, VGailite, VLola, DLoza, ESemenikhina, VKalvinsh, IFinn, PPetersen, KDRitchie, JWKhan, NTumber, ACollins, LSVadlamudi, SMBjörkling, FSehested, M Novel amide derivatives as inhibitors of histone deacetylase: design, synthesis and SAR. Eur J Med Chem 44:1067-85 (2009)  
Target
Name:
Histone deacetylase 7
Synonyms:
HD7 HDAC7A Histone acetylase 7 (HDAC7) Human HDAC7
Type:
Chromatin regulator; hydrolase; repressor
Mol. Mass.:
102942.62
Organism:
Homo sapiens (Human)
Description:
Q8WUI4
Residue:
952
  
Inhibitor
Name:
BDBM50268121
Synonyms:
(E)-3-(4-Chloro-2-fluorophenyl)-N-[6-(hydroxyamino)-6-oxohexyl]-2-propenamide | CHEMBL484489
Type:
Small organic molecule
Emp. Form.:
C15H18ClFN2O3
Mol. Mass.:
328.766
SMILES:
ONC(=O)CCCCCNC(=O)\C=C\c1ccc(Cl)cc1F
: