Target
Histone deacetylase 8
Ligand
BDBM50268121
Substrate
Meas. Tech.
ChEMBL_521110 (CHEMBL960371)
IC50
1620±n/a nM
Citation
 Andrianov, VGailite, VLola, DLoza, ESemenikhina, VKalvinsh, IFinn, PPetersen, KDRitchie, JWKhan, NTumber, ACollins, LSVadlamudi, SMBjörkling, FSehested, M Novel amide derivatives as inhibitors of histone deacetylase: design, synthesis and SAR. Eur J Med Chem 44:1067-85 (2009)  
Target
Name:
Histone deacetylase 8
Synonyms:
HD8 HDAC8_HUMAN Histone deacetylase 8 (HDAC-8) | Human HDAC8
Type:
Enzyme
Mol. Mass.:
41749.60
Organism:
Homo sapiens (Human)
Description:
Q9BY41
Residue:
377
  
Inhibitor
Name:
BDBM50268121
Synonyms:
(E)-3-(4-Chloro-2-fluorophenyl)-N-[6-(hydroxyamino)-6-oxohexyl]-2-propenamide | CHEMBL484489
Type:
Small organic molecule
Emp. Form.:
C15H18ClFN2O3
Mol. Mass.:
328.766
SMILES:
ONC(=O)CCCCCNC(=O)\C=C\c1ccc(Cl)cc1F
: