Target
Histone deacetylase 9
Ligand
BDBM50268121
Substrate
Meas. Tech.
ChEMBL_521111 (CHEMBL960372)
IC50
3.9±n/a nM
Citation
 Andrianov, VGailite, VLola, DLoza, ESemenikhina, VKalvinsh, IFinn, PPetersen, KDRitchie, JWKhan, NTumber, ACollins, LSVadlamudi, SMBjörkling, FSehested, M Novel amide derivatives as inhibitors of histone deacetylase: design, synthesis and SAR. Eur J Med Chem 44:1067-85 (2009)  
Target
Name:
Histone deacetylase 9
Synonyms:
HD9 HDAC7B HDAC9_HUMAN Histone acetylase 9 (HDAC9) Histone deacetylase 9 (HDAC9) Human HDAC9 MITR
Type:
Enzyme
Mol. Mass.:
111304.31
Organism:
Homo sapiens (Human)
Description:
Q9UKV0
Residue:
1011
  
Inhibitor
Name:
BDBM50268121
Synonyms:
(E)-3-(4-Chloro-2-fluorophenyl)-N-[6-(hydroxyamino)-6-oxohexyl]-2-propenamide | CHEMBL484489
Type:
Small organic molecule
Emp. Form.:
C15H18ClFN2O3
Mol. Mass.:
328.766
SMILES:
ONC(=O)CCCCCNC(=O)\C=C\c1ccc(Cl)cc1F
: