Target
Melanocortin receptor 3
Ligand
BDBM50253748
Substrate
Meas. Tech.
ChEMBL_538610 (CHEMBL1027400)
EC50
44±n/a nM
Citation
 Tian, XSwitzer, AGDerose, SAMishra, RKSolinsky, MGMumin, RNEbetino, FHJayasinghe, LRWebster, MEColson, AOCrossdoersen, DPinney, BBFarmer, JADowty, MEObringer, CMCruze, CABurklow, MLSuchanek, PMDong, LDirr, MKSheldon, RJWos, JA Discovery of orally bioavailable 1,3,4-trisubstituted 2-oxopiperazine-based melanocortin-4 receptor agonists as potential antiobesity agents. J Med Chem 51:6055-66 (2008)  
Target
Name:
Melanocortin receptor 3
Synonyms:
MC3-R MC3R_HUMAN Melanocortin receptor (M3 and M4)
Type:
Enzyme
Mol. Mass.:
36044.86
Organism:
Homo sapiens (Human)
Description:
P41968
Residue:
323
  
Inhibitor
Name:
BDBM50253748
Synonyms:
(2S)-N-((1R)-1-[(4-Fluorophenyl)methyl]-2-{(2S)-4-[(1S)-2-(methylamino)-1-(2-naphthalenylmethyl)-2-oxoethyl]-3-oxo-2-propyl-1-piperazinyl}-2-oxoethyl)-2-piperidinecarboxamide | CHEMBL448410
Type:
Small organic molecule
Emp. Form.:
C36H44FN5O4
Mol. Mass.:
629.7641
SMILES:
CCC[C@@H]1N(CCN([C@@H](Cc2ccc3ccccc3c2)C(=O)NC)C1=O)C(=O)[C@@H](Cc1ccc(F)cc1)NC(=O)[C@H]1CCCCN1
: