Target
Farnesyl pyrophosphate synthase
Ligand
BDBM50273799
Substrate
Meas. Tech.
ChEMBL_538311 (CHEMBL1036745)
IC50
883.1±n/a nM
Citation
 Simoni, DGebbia, NInvidiata, FPEleopra, MMarchetti, PRondanin, RBaruchello, RProvera, SMarchioro, CTolomeo, MMarinelli, LLimongelli, VNovellino, EKwaasi, ADunford, JBuccheri, SCaccamo, NDieli, F Design, synthesis, and biological evaluation of novel aminobisphosphonates possessing an in vivo antitumor activity through a gammadelta-T lymphocytes-mediated activation mechanism. J Med Chem 51:6800-7 (2008)  
Target
Name:
Farnesyl pyrophosphate synthase
Synonyms:
Dimethylallyltranstransferase FPP synthase FPPS_HUMAN Farnesyl diphosphate synthase Farnesyl diphosphate synthetase Farnesyl pyrophosphate synthetase KIAA1293 | P14324
Type:
Enzyme
Mol. Mass.:
48272.89
Organism:
Homo sapiens (Human)
Description:
P14324
Residue:
419
  
Inhibitor
Name:
BDBM50273799
Synonyms:
CHEMBL452354 | [2-(6-Chloro-purin-9-yl)ethyl]-bisphosphonic acid
Type:
Small organic molecule
Emp. Form.:
C7H9ClN4O6P2
Mol. Mass.:
342.57
SMILES:
OP(O)(=O)C(Cn1cnc2c(Cl)ncnc12)P(O)(O)=O
: