Target
Cytochrome P450 2D6
Ligand
BDBM50246494
Substrate
Meas. Tech.
ChEMBL_558436 (CHEMBL963842)
IC50
2000±n/a nM
Citation
 Pontillo, JWu, DChing, BHudson, SGenicot, MJGao, YEwing, TFleck, BAGogas, KAparicio, AWang, HWen, JWade, WS Synthesis and structure-activity relationships of selective norepinephrine reuptake inhibitors (sNRI) with improved pharmaceutical characteristics. Bioorg Med Chem Lett 18:6151-5 (2008)  
Target
Name:
Cytochrome P450 2D6
Synonyms:
CP2D6_HUMAN CYP2DL1 Cytochrome P450 2D6 (CYP2D6) P450-DB1
Type:
Protein
Mol. Mass.:
55774.82
Organism:
Homo sapiens (Human)
Description:
P10635
Residue:
497
  
Inhibitor
Name:
BDBM50246494
Synonyms:
(1S,2R)-2-((methylamino)methyl)-1-(o-tolyloxy)-2,3-dihydro-1H-inden-2-ol | CHEMBL507359
Type:
Small organic molecule
Emp. Form.:
C18H21NO2
Mol. Mass.:
283.3648
SMILES:
CNC[C@]1(O)Cc2ccccc2[C@@H]1Oc1ccccc1C
: