Target
Cannabinoid receptor 2
Ligand
BDBM50254045
Substrate
Meas. Tech.
ChEMBL_560056 (CHEMBL1022443)
EC50
8±n/a nM
Citation
 Marx, IEDiMauro, EFCheng, AEmkey, RHitchcock, SAHuang, LHuang, MYHuman, JLee, JHLi, XMartin, MWWhite, RDFremeau, RTPatel, VF Discovery of alpha-amidosulfones as potent and selective agonists of CB2: synthesis, SAR, and pharmacokinetic properties. Bioorg Med Chem Lett 19:31-5 (2008)  
Target
Name:
Cannabinoid receptor 2
Synonyms:
CANNABINOID CB2 CB2 CB2B CNR2_HUMAN Cannabinoid CB2 receptor Cannabinoid receptor 2 (CB2R) | hCB2
Type:
G Protein-Coupled Receptor (GPCR)
Mol. Mass.:
39690.94
Organism:
Homo sapiens (Human)
Description:
P34972
Residue:
360
  
Inhibitor
Name:
BDBM50254045
Synonyms:
CHEMBL460565 | N-(9-ethyl-9H-carbazol-3-yl)-1-(phenylsulfonyl)cyclopropanecarboxamide
Type:
Small organic molecule
Emp. Form.:
C24H22N2O3S
Mol. Mass.:
418.508
SMILES:
CCn1c2ccccc2c2cc(NC(=O)C3(CC3)S(=O)(=O)c3ccccc3)ccc12
: