Target
Adenosine receptor A3
Ligand
BDBM50266416
Substrate
Meas. Tech.
ChEMBL_516388 (CHEMBL988627)
Ki
19±n/a nM
Citation
 Lanier, MCMoorjani, MLuo, ZChen, YLin, ETellew, JEZhang, XWilliams, JPGross, RSLechner, SMMarkison, SJoswig, TKargo, WPiercey, JSantos, MMalany, SZhao, MPetroski, RCrespo, MIDíaz, JLSaunders, JWen, JO'Brien, ZJalali, KMadan, ASlee, DH N-[6-amino-2-(heteroaryl)pyrimidin-4-yl]acetamides as A2A receptor antagonists with improved drug like properties and in vivo efficacy. J Med Chem 52:709-17 (2009)  
Target
Name:
Adenosine receptor A3
Synonyms:
A3 adenosine receptor (hA3) ADORA3 | Adenosine A3 receptor (A3AR)
Type:
G Protein-Coupled Receptor (GPCR)
Mol. Mass.:
36197.32
Organism:
Homo sapiens (Human)
Description:
P0DMS8
Residue:
318
  
Inhibitor
Name:
BDBM50266416
Synonyms:
CHEMBL458224 | N-[2-(3,5-Dimethylpyrazol-1-yl)-6-(2-(R)-methoxymethylpyrrolidin-1-yl)pyrimidin-4-yl]acetamide
Type:
Small organic molecule
Emp. Form.:
C17H24N6O2
Mol. Mass.:
344.4115
SMILES:
COC[C@H]1CCCN1c1cc(NC(C)=O)nc(n1)-n1nc(C)cc1C
: