Target
Adenosine receptor A2a
Ligand
BDBM50266415
Substrate
Meas. Tech.
ChEMBL_516361 (CHEMBL987748)
Ki
9±n/a nM
Citation
 Lanier, MCMoorjani, MLuo, ZChen, YLin, ETellew, JEZhang, XWilliams, JPGross, RSLechner, SMMarkison, SJoswig, TKargo, WPiercey, JSantos, MMalany, SZhao, MPetroski, RCrespo, MIDíaz, JLSaunders, JWen, JO'Brien, ZJalali, KMadan, ASlee, DH N-[6-amino-2-(heteroaryl)pyrimidin-4-yl]acetamides as A2A receptor antagonists with improved drug like properties and in vivo efficacy. J Med Chem 52:709-17 (2009)  
Target
Name:
Adenosine receptor A2a
Synonyms:
A2A adenosine receptor (hA2A) ADENOSINE A2 ADORA2 Adenosine A2A receptor (A2AAR)
Type:
G Protein-Coupled Receptor (GPCR)
Mol. Mass.:
44716.46
Organism:
Homo sapiens (Human)
Description:
P29274
Residue:
412
  
Inhibitor
Name:
BDBM50266415
Synonyms:
CHEMBL516168 | N-[2-(3,5-Dimethylpyrazol-1-yl)-6-(2-methoxymethylpyrrolidin-1-yl)pyrimidin-4-yl]acetamide
Type:
Small organic molecule
Emp. Form.:
C17H24N6O2
Mol. Mass.:
344.4115
SMILES:
COCC1CCCN1c1cc(NC(C)=O)nc(n1)-n1nc(C)cc1C
: