Target
Adenosine receptor A1
Ligand
BDBM50255248
Substrate
Meas. Tech.
ChEMBL_516364 (CHEMBL987751)
Ki
92±n/a nM
Citation
 Lanier, MCMoorjani, MLuo, ZChen, YLin, ETellew, JEZhang, XWilliams, JPGross, RSLechner, SMMarkison, SJoswig, TKargo, WPiercey, JSantos, MMalany, SZhao, MPetroski, RCrespo, MIDíaz, JLSaunders, JWen, JO'Brien, ZJalali, KMadan, ASlee, DH N-[6-amino-2-(heteroaryl)pyrimidin-4-yl]acetamides as A2A receptor antagonists with improved drug like properties and in vivo efficacy. J Med Chem 52:709-17 (2009)  
Target
Name:
Adenosine receptor A1
Synonyms:
A1 adenosine receptor (hA1) AA1R_HUMAN ADORA1 Adenosine A1-receptor Adenosine receptor A1 (hA1) | Adenosine transporter (AdT)
Type:
G Protein-Coupled Receptor (GPCR)
Mol. Mass.:
36520.92
Organism:
Homo sapiens (Human)
Description:
P30542
Residue:
326
  
Inhibitor
Name:
BDBM50255248
Synonyms:
CHEMBL482011 | N-[2-(3,5-Dimethylpyrazol-1-yl)-6-((R)-2-methoxymethylpyrrolidin-1-yl)pyrimidin-4-yl]-3-methylbutyramide
Type:
Small organic molecule
Emp. Form.:
C20H30N6O2
Mol. Mass.:
386.4912
SMILES:
COC[C@H]1CCCN1c1cc(NC(=O)CC(C)C)nc(n1)-n1nc(C)cc1C
: