Target
Adenosine receptor A1
Ligand
BDBM50255184
Substrate
Meas. Tech.
ChEMBL_516364 (CHEMBL987751)
Ki
215±n/a nM
Citation
 Lanier, MCMoorjani, MLuo, ZChen, YLin, ETellew, JEZhang, XWilliams, JPGross, RSLechner, SMMarkison, SJoswig, TKargo, WPiercey, JSantos, MMalany, SZhao, MPetroski, RCrespo, MIDíaz, JLSaunders, JWen, JO'Brien, ZJalali, KMadan, ASlee, DH N-[6-amino-2-(heteroaryl)pyrimidin-4-yl]acetamides as A2A receptor antagonists with improved drug like properties and in vivo efficacy. J Med Chem 52:709-17 (2009)  
Target
Name:
Adenosine receptor A1
Synonyms:
A1 adenosine receptor (hA1) AA1R_HUMAN ADORA1 Adenosine A1-receptor Adenosine receptor A1 (hA1) | Adenosine transporter (AdT)
Type:
G Protein-Coupled Receptor (GPCR)
Mol. Mass.:
36520.92
Organism:
Homo sapiens (Human)
Description:
P30542
Residue:
326
  
Inhibitor
Name:
BDBM50255184
Synonyms:
CHEMBL521081 | N-[6-((S)-2-Methoxymethylpyrrolidin-1-yl)-2-(5-methylfuran-2-yl)pyrimidin-4-yl]acetamide
Type:
Small organic molecule
Emp. Form.:
C17H22N4O3
Mol. Mass.:
330.3816
SMILES:
COC[C@@H]1CCCN1c1cc(NC(C)=O)nc(n1)-c1ccc(C)o1
: