Target
Adenosine receptor A1
Ligand
BDBM50266384
Substrate
Meas. Tech.
ChEMBL_516364 (CHEMBL987751)
Ki
323±n/a nM
Citation
 Lanier, MCMoorjani, MLuo, ZChen, YLin, ETellew, JEZhang, XWilliams, JPGross, RSLechner, SMMarkison, SJoswig, TKargo, WPiercey, JSantos, MMalany, SZhao, MPetroski, RCrespo, MIDíaz, JLSaunders, JWen, JO'Brien, ZJalali, KMadan, ASlee, DH N-[6-amino-2-(heteroaryl)pyrimidin-4-yl]acetamides as A2A receptor antagonists with improved drug like properties and in vivo efficacy. J Med Chem 52:709-17 (2009)  
Target
Name:
Adenosine receptor A1
Synonyms:
A1 adenosine receptor (hA1) AA1R_HUMAN ADORA1 Adenosine A1-receptor Adenosine receptor A1 (hA1) | Adenosine transporter (AdT)
Type:
G Protein-Coupled Receptor (GPCR)
Mol. Mass.:
36520.92
Organism:
Homo sapiens (Human)
Description:
P30542
Residue:
326
  
Inhibitor
Name:
BDBM50266384
Synonyms:
CHEMBL456287 | N-[6-(3,4-Dihydro-1H-isoquinolin-2-yl)-2-(3,5-dimethylpyrazol-1-yl)pyrimidin-4-yl]acetamide
Type:
Small organic molecule
Emp. Form.:
C20H22N6O
Mol. Mass.:
362.4283
SMILES:
CC(=O)Nc1cc(nc(n1)-n1nc(C)cc1C)N1CCc2ccccc2C1
: