Target
Adenosine receptor A2a
Ligand
BDBM50266416
Substrate
Meas. Tech.
ChEMBL_516368 (CHEMBL987755)
Ki
48±n/a nM
Citation
 Lanier, MCMoorjani, MLuo, ZChen, YLin, ETellew, JEZhang, XWilliams, JPGross, RSLechner, SMMarkison, SJoswig, TKargo, WPiercey, JSantos, MMalany, SZhao, MPetroski, RCrespo, MIDíaz, JLSaunders, JWen, JO'Brien, ZJalali, KMadan, ASlee, DH N-[6-amino-2-(heteroaryl)pyrimidin-4-yl]acetamides as A2A receptor antagonists with improved drug like properties and in vivo efficacy. J Med Chem 52:709-17 (2009)  
Target
Name:
Adenosine receptor A2a
Synonyms:
AA2AR_RAT Adenosine A2 receptor Adenosine Receptors A2a (A2a) Adenosine receptors A2a Rat striatal adenosine A2a receptor
Type:
G Protein-Coupled Receptor (GPCR)
Mol. Mass.:
45015.65
Organism:
Rattus norvegicus (rat)
Description:
Rat A2A receptors expressed in CHO cells.
Residue:
410
  
Inhibitor
Name:
BDBM50266416
Synonyms:
CHEMBL458224 | N-[2-(3,5-Dimethylpyrazol-1-yl)-6-(2-(R)-methoxymethylpyrrolidin-1-yl)pyrimidin-4-yl]acetamide
Type:
Small organic molecule
Emp. Form.:
C17H24N6O2
Mol. Mass.:
344.4115
SMILES:
COC[C@H]1CCCN1c1cc(NC(C)=O)nc(n1)-n1nc(C)cc1C
: