Target
Adenosine receptor A2a
Ligand
BDBM26237
Substrate
Meas. Tech.
ChEMBL_516361 (CHEMBL987748)
Ki
2.3±n/a nM
Citation
 Lanier, MCMoorjani, MLuo, ZChen, YLin, ETellew, JEZhang, XWilliams, JPGross, RSLechner, SMMarkison, SJoswig, TKargo, WPiercey, JSantos, MMalany, SZhao, MPetroski, RCrespo, MIDíaz, JLSaunders, JWen, JO'Brien, ZJalali, KMadan, ASlee, DH N-[6-amino-2-(heteroaryl)pyrimidin-4-yl]acetamides as A2A receptor antagonists with improved drug like properties and in vivo efficacy. J Med Chem 52:709-17 (2009)  
Target
Name:
Adenosine receptor A2a
Synonyms:
A2A adenosine receptor (hA2A) ADENOSINE A2 ADORA2 Adenosine A2A receptor (A2AAR)
Type:
G Protein-Coupled Receptor (GPCR)
Mol. Mass.:
44716.46
Organism:
Homo sapiens (Human)
Description:
P29274
Residue:
412
  
Inhibitor
Name:
BDBM26237
Synonyms:
CHEMBL458242 pyrazolylpyrimidine derivative, 6g
Type:
Small organic molecule
Emp. Form.:
C17H18N6O2
Mol. Mass.:
338.3638
SMILES:
COc1cncc(c1)-c1cc(NC(C)=O)nc(n1)-n1nc(C)cc1C
: