Target
Integrin alpha-V
Ligand
BDBM50276748
Substrate
Meas. Tech.
ChEMBL_541189 (CHEMBL1031478)
IC50
0.9±n/a nM
Citation
 Cini, NTrabocchi, AMenchi, GBottoncetti, ARaspanti, SPupi, AGuarna, A Morpholine-based RGD-cyclopentapeptides as alphavbeta3/alphavbeta5 integrin ligands: role of configuration towards receptor binding affinity. Bioorg Med Chem 17:1542-9 (2009)  
Target
Name:
Integrin alpha-V
Synonyms:
ITAV_HUMAN Integrin alpha-V/alpha-5 VNRA Vitronectin receptor | Vitronectin receptor subunit alpha
Type:
PROTEIN
Mol. Mass.:
116024.92
Organism:
Homo sapiens (Human)
Description:
ChEMBL_582336
Residue:
1048
  
Inhibitor
Name:
BDBM50276748
Synonyms:
CHEMBL460012 | [(1R,3S,9S,11S,14R)-9-(3-Guanidino-propyl)-4,7,10,18-tetraoxo-2,5,8,19-tetraaza-tricyclo[9.6.2.0*14,19*]nonadec-3-yl]-acetic acid
Type:
Small organic molecule
Emp. Form.:
C21H33N7O6
Mol. Mass.:
479.53
SMILES:
[#7]\[#6](-[#7])=[#7]\[#6]-[#6]-[#6]-[#6@@H]-1-[#7]-[#6](=O)-[#6]-[#7]-[#6](=O)-[#6@H](-[#6]-[#6](-[#8])=O)-[#7]-[#6@@H]-2-[#6]-[#6]-[#6]-[#6@@H]-3-[#6]-[#6]-[#6@H](-[#7]-3-[#6]-2=O)-[#6]-1=O
: