Target
Coagulation factor X
Ligand
BDBM50266921
Substrate
Meas. Tech.
ChEMBL_563985 (CHEMBL956028)
IC50
0.08±n/a nM
Citation
 Van Huis, CACasimiro-Garcia, ABigge, CFCody, WLDudley, DAFilipski, KJHeemstra, RJKohrt, JTLeadley, RJNarasimhan, LSMcClanahan, TMochalkin, IPamment, MPeterson, JTSahasrabudhe, VSchaum, RPEdmunds, JJ Exploration of 4,4-disubstituted pyrrolidine-1,2-dicarboxamides as potent, orally active Factor Xa inhibitors with extended duration of action. Bioorg Med Chem 17:2501-11 (2009)  
Target
Name:
Coagulation factor X
Synonyms:
Activated coagulation factor X (FXa) Coagulation factor X precursor F10 Factor X heavy chain Factor Xa Stuart-Prower factor
Type:
Enzyme
Mol. Mass.:
54726.60
Organism:
Homo sapiens (Human)
Description:
Residue:
488
  
Inhibitor
Name:
BDBM50266921
Synonyms:
(2R,4S)-N1-(4-Chlorophenyl)-N2-(2-fluoro-4-(2-oxopyridin-1(2H)-yl)phenyl)-4-hydroxy-4-phenylpyrrolidine-1,2-dicarboxamide CHEMBL515107
Type:
Small organic molecule
Emp. Form.:
C29H24ClFN4O4
Mol. Mass.:
546.977
SMILES:
O[C@@]1(C[C@@H](N(C1)C(=O)Nc1ccc(Cl)cc1)C(=O)Nc1ccc(cc1F)-n1ccccc1=O)c1ccccc1
: